{"text_format":"1","workbook":"xlsx","n_sheets":2,"sheets":["List","statistics"],"not_rendered":{"charts":0,"images":0,"macros":1,"external_links":0,"defined_names":2,"comments":0,"pivot_tables":0},"unopened":[],"bounds":{"document_bytes":16777216,"sheet_cells":100000,"rows_first":2000,"rows_last":500,"rows_between":2000,"halvings":0,"cell_chars":16384,"cell_head_chars":4096},"cells_cut":0,"cells_raw":0,"read":"whole","date_system":"1900"}

{"sheet":"List","index":0,"n_rows":93,"n_cols":15,"rows_kept":93,"cut":false,"hidden":false,"merged":[]}
["Name","Position","Affiliation","Postal address","City","Country","Archive / approach","Field of expertise","Current work","Studied regions","Applied methods ","Further expertise or interests","Link to a personal webpage","Contact","ORCID"]
["Marieke Ahlborn","Junior scientist","GFZ German Research Centre for Geosciences","Telegrafenberg, 14473 Postdam","Potsdam","Germany","Lake sediments","Floods, monsoon, climate reconstruction","Flood events in the Dead Sea","Dead Sea, Tibetan Plateau","microfacies analysis, geochemistry (XRF, CNS)","ostracods, OSL","http://www.gfz-potsdam.de/sektion/klimadynamik-und-landschaftsentwicklung/mitarbeiter/profil/marieke-ahlborn/","marieke.ahlborn@gfz-potsdam.de"]
["Juan Antonio Ballesteros","Junior scientist","University of Geneva, Institute of Environmental Science",null,"Geneva","Switzerland","Tree rings, Hydrological modelling","Floods, mountian rivers, Flood risk estimation, Statistics","Flood events in Kashmir","Spain,  Guatemala, Indian Himalayas, Tien Shan - Central Asia, Alps, Tatra mountains","tree-rings, climate modelling, hyraulic modelling","climate","http://www.dendrolab.ch/en/jab.php","juan.ballesteros@unige.ch"]
["Bruno Wilhelm","Junior scientist","University Grenoble Alpes, Insitut des Géosciences de l'Environnement, Grenoble",null,"Grenoble","France","Lake sediments","Flood reconstruction, mountain rivers","Reconstruct and analyse the flood variability in the European Alps","European Alps","Sedimentology, high-resolution geochemistry, multi-approach dating, calibration","hydro-meteo reanalysis, historical evidences","http://www.lthe.fr/LTHE/pageperso/wilhelm/","bruno.wilhelm@univ-grenoble-alpes.fr"]
["Rhawn Denniston","Professor","Department of Geology, Cornell College, Iowa",null,"Mt Vernon, IA","United States","Speleothems","hydroclimate (including extreme events) reconstructions","Cave responses to extreme rainfall events in Australian tropics; tropical cyclone reconstructions in the Australian tropics; Holocene evolution of the Indo-Australian summer monsoon; glacial and Holocene hydroclimate from western Iberia","Western Iberia, Australian tropics, Great Basin ","stalagmite petrography; U-series dating; stable isotopes","ENSO reconstructions from Miocene-Pliocene corals","http://www.cornellcollege.edu/academics/our-faculty/faculty-profile/index.php/show/rdenniston","rdenniston@cornellcollege.edu"]
["Manfred Mudelsee","Industry","Climate Risk Analysis",null,"Bad Gandersheim","Germany","Statistics","Statistics, time series analysis, extreme value analysis, risk analysis","Statistical methods developement (occurrence rate estimation, heavy-tail estimation) for analysing flood events","Statistical methods applicable to all regions","Statistical methods applicable to all type of data","Environmental physics, geology, philosophy","http://www.climate-risk-analysis.com","mudelsee@climate-risk-analysis.com"]
["Francis Ludlow","Professor","Trinity College Dublin, School of Histories & Humanities",null,"Dublin","Ireland","Historical archives, Tree rings","Historical climatology, environmental history","Reconstructing the frequency and social impacts of flooding in medieval Ireland and continental Europe; similar work for the Nile and Euphrates rivers, including the impact of explosive volcanism on their hydrology","Ireland, continental Europe, Nile River catchment and basin, Euphrates River catchment and basin","analysis of responses in tree-rings, historical records","environmental history","https://www.tcd.ie/trinitylongroomhub/iehn/profiles/ludlowf.php","ludlowf@tcd.ie"]
["Lucas Kämpf","Junior scientist","Institute for Soil Science and Site Ecology, TU Dresden",null,"Dresden","Germany","Lake sediments","Flood reconstruction, flood monitoring","Environmental change and human impact in the Southern Black Forest","European Alps, Black forest","hydro-sedimentary monitoring techniques, microfacies analysis, geochemistry (µXRF, CNS)","Sedimentology, stable isotopes","https://tu-dresden.de/bu/umwelt/forst/boden/das-institut/staff/scientific-staff/lucas_kaempf","lucas.kaempf@tu-dresden.de"]
["Neil Macdonald","Senior scientist","University of Liverpool",null,"Liverpool","UK","Historical archives","Archival flood/drought and weather reconstruction. Augmentation of series  e.g. historical and palaeo (rivers and lakes)","Reconstruction of extreme weather / floods and droughts from documentary archives and lakes","NW Europe & Turkey","Archival studies","XRF, sediments","https://www.liverpool.ac.uk/environmental-sciences/staff/neil-macdonald/ ","neil.macdonald@liverpool.ac.uk"]
["Stephan Dietrich","Junior scientist","Institute of Hydrology (BfG)",null,"Koblenz","Germany","Fluvial sediments, Hydrological modelling","hydroclimatic (floods, persistent low discharge) influence on fluvial sediment transport, reconstructions, numerical modelling","quantification of sediment transport pathways in large rivers (bed and suspended load), controlling drivers on (multi)decadal timescales","German waterways and rivers, lake sediments","sedimentology, monitoring of SPM and bed load, numerical modelling (hydrodynamics, sediement transport)","linking monitoring to paleo archives, climate modelling, internal climate variability, microfacies analysis, particle size analytics","http://www.bafg.de/DE/08_Ref/M3/04_Mitarbeiter/dietrich/dietrich_node.html","dietrich@bafg.de"]
["Ana Moreno","Senior scientist","Pyrenean Institute of Ecology - CSIC",null,"Zaragoza","Spain","Lake sediments","Floods, climate reconstructions","Glacial and holocene hydrology from Iberian caves","Iberia, Chile","geochemistry (XRF, stable isotopes) and facies analyses","Cave speleothems","https://sites.google.com/site/anamorenocaballud/","amoreno@ipe.csic.es"]
["Selvaraj Kandasamy","Professor","Xiamen University",null,"Xiamen","China","Lake sediments","Asian monsoon, Holocene, Extreme Events","Holocene hydroclimate in SE China; Linking extreme rainfall events with sediment grain size and geochemical proxies from lake and marine sediments cores","China and western Pacific marginal seas","Sedimentological and geochemical proxies, including stable C and N isotopes","Geochemistry","http://dgo.xmu.edu.cn/research/Palaeoceanclim.html","selvaraj@xmu.edu.cn; kselva8@yahoo.com"]
["Zhixin Hao","Professor","Institute of Geographic Sciences and Natural Resources Research, Chinese Academy of Sciences",null,"Beijing","China","Historical archives","Reconstruction, Simulation using CESM model","Precipitation reconstruction in Southwest China using Chinese historical documents; Developing the dataset of climate change during the past 2000 years over China","China","drought or flood graded index based on the descriptions of historical documents","social impact from the drought and flood",null,"haozx@igsnrr.ac.cn"]
["Daniele Colombaroli","Senior scientist","Institute of Plant Sciences and Oeschger Centre for Climate Change Research & Institute of Plant Sciences, University of Bern. ",null,"Bern","Switzerland","Lake sediments","Fire-erosion interactions, vegetation dynamic","Flood events and watershed erosion from a high resolution sediment core in  Oregon","Pacific Northwest, Mediterranean, East Africa, Swiss Alps","sediment charcoal, LOI, magnetic susceptibility, CT","Pollen, quantitative analyses, stable isotopes in tree rings","https://www.researchgate.net/profile/Daniele_Colombaroli","daniele.colombaroli@ips.unibe.ch"]
["Paolo Scussolini","Junior scientist","Institute for Environmental Studies, Vrije Universiteit Amsterdam",null,"Amsterdam","Netherlands","Climate modelling","Flood modeling, climate reconstruction, climate modeling","Effects of climate on Impacts of floods: in the present, future, and in past climates","Global, Vietnam, Europe","Combination of models: climate, hydrological, impact models","Paleoceanography, marine sediments, flood impacts","http://ivm.vu.nl/en/people/researchers/Water-Climate-Risk/Scussolini/index.aspx","paolo.scussolini@vu.nl"]
["Sebastien Bertrand","Professor","Renard Centre of Marine Geology, Ghent University",null,"Ghent","Belgium","Fjord sediments","Flood reconstruction, paleohydrology, river sediment transport","Late Holocene Glacial Lake Outburst Floods in Patagonia; sediment inorganic geochemical tracers of hydrological variability","Patagonia","Sedimentology, sediment geochemistry","paleoclimatology, sediments from source-to-sink","http://www.rcmg.ugent.be/ ; https://geologieugent.wordpress.com/expeditions/paleo-glofs/","sebastien.bertrand@ugent.be"]
["Vincent Ollivier","Junior scientist","CNRS UMR 7269 LAMPEA Aix Marseille University",null,"Aix-en-Provence","France","Fluvial sediments","Erosion, sedimentation and flood rythmicities reconstruction between Mediterranean and Caspian seas","Flood and geomorphic response to climate and base level changes in connection with past societies","Southern France, Italy, Romania, Armenia, Azerbaijan, Georgia","Geomorphology, sedimentology, geochemistry, multi-approach dating, microfacies analysis, geoarcheology ","tufa and travertine series, spectral analysis, micromorphology, cosmonuclides, hydrogeology","http://lampea.cnrs.fr/spip.php?article44&lang=fr","ollivier@mmsh.univ-aix.fr"]
["Samuel Munoz","Junior scientist","Woods Hole Oceanographic Institution",null,"Woods Hole, MA","United States","Fluvial sediments","Flood reconstruction, alluvial rivers","Flood reconstruction on the Mississippi River and its tributaries; extreme flooding from tropical cyclones; Holocene hydroclimates in response to climate and land use change","Eastern North America; northern Canada; Myanmar; Romania","Sedimentology, bulk geochemistry (XRF), radiography, radiogenic isotopes, multi-approach dating, calibration","Quaterary paleoecology/paleoclimate, land use history, geoarchaeology","https://munozse.wordpress.com/","smunoz@whoi.edu"]
["Pierre Brigode","Junior scientist","Université de Nice Sophia Antipolis, UMR Géoazur",null,"Valbonne","France","Hydrological modelling","Floods, droughts, climate reconstruction, hydrological modelling","Streamflow reconstruction (floods and mean annual values) over France and Québec catchments","France and Québec","Climatic reconstruction using analogy of atmospheric pressure situations, rainfall-runoff transformation.","Hydrological modelling, uncertainty analysis, statistics","https://sites.google.com/site/pierrebrigode/","pierre.brigode@unice.fr"]
["Georges Pichard","Senior scientist","Resarch associate at CEREGE (Centre Européen de Recherche et Enseignement des Géosciences de l'Environnement) Aix-en Provence",null,"Aix-en-Provence","France","Historical archives","Flood reconstruction Rhône River and other rivers in Provence, Durance, Arc, Huveaune, Argens…","Flood and climatic history of the South-East France, rainfall, storm, temperature extreme eevents reconstruction","South-East France","historical methods","Environmental history, History of Cartography, Landscape and Society","https://www.histrhone.cerege.fr ","georgpichard@yahoo.fr"]
["Isabelle Mayer-Jouanjean","Junior scientist","Ouranos (Consortium on Regional Climatology and Adaptation to Climate Change) and University of Quebec in Montreal",null,"Montreal","Canada","Historical archives","History of risks: floods, low flows, cyclones, storms...","Execution of a historical database on floods and low flows in Quebec","South-West of Indian Ocean (Reunion/Mauritius/Malagasy islands),  Province of Quebec (Canada)","Inventory of sources (written, illustrated, oral, video), data inputs and crossing of data, historical analyzes","Freezing rain, avalanches, coastal erosion, volcanoes, earthquakes, etc.","http://www.acfas.ca/user/55326 ","mj.isabelle@ouranos.ca "]
["Vincent Pellerito","Industry","Self-employed/AECOM",null,"?","Morocco","Statistics","GIS, database development, nearshore processes","Environmental data management, database application development and GIS","Albemarle Sound, NC, USA; Delaware Estuary, mid-Atlantic region, USA","spatial data analysis, relative risk assessment","amino acid racemization as a relative age-dating method","https://www.linkedin.com/in/vincent-pellerito-31784333","vpellerito.ds@gmail.com"]
["Libor Elleder ","Senior scientist","Czech Hydrometerorological Institute, Prague",null,"Prague","Czech Republic","Historical archives","Flood a drouhts spell reconstruction","Reconstruction of historical and early instrumental  peak discharges ","Czech republic","Hydrologicla Interpretation of documentary sources and flood marks, hydrological model.  ","Volcanic impact on climate","under construction","elleder@chmi.cz"]
["Benjamin Amann","Junior scientist","Department of Geography and Planning, Queen's University, Kingston ON",null,"Kingston","Canada","Lake sediments","Sedimentation process understanding, flood reconstruction, annually-resolved climate reconstruction","Reconstruction of season-specific climate variability and the occurrence of exceptional events in the Swiss Alps and the Canadian High Arctic","European Alps, High Arctic","Microstratigraphy, scanning geochemistry, varve-radioisotope-radiocarbon dating, climate-sensitivity tests, calibration-validation statistics","Hydroclimate, algal responses to environmental changes","http://benjaminamann.wixsite.com/amannb  http://www.queensu.ca/geographyandplanning/evex/","benjamin.amann@queensu.ca"]
["Juan Pablo Corella","Junior scientist","Department of Atmospheric Chemistry and Climate, IQFR-CSIC (Spanish National Research Council)",null,"Madrid","Spain","Lake sediments","Flood reconstruction, sediment transport, subaquatic landslides","Flood reconstruction in Western Mediterranean integrating fluvial, marine and lake sequences","Iberian Peninsula, Western Alps, Greenland","Clastic sedimentology, Geochemistry, Dating, Geotechnical analyses","Atmospheric chemistry, fluvial, marine and Ice core archives, Geology","http://ac2.iqfr.csic.es/en/","pcorella@iqfr.csic.es"]
["Alexis Metzger","Junior scientist","University of Strasbourg",null,"Strasbourg","France","Historical archives","Floods, droughts, vulnerability, climate history","reconstruct the drought variability in Alsace (France)","Rhine valley, Dordogne valley, The Netherlands","climate reconstruction","history of art, cultural and historical geography, environmental history","http://live.unistra.fr/le-laboratoire/annuaire/metzger-alexis/","alexis.metzger@live-cnrs.unistra.fr"]
["Ahmad Bashir",null,"Department of Geology, Nawakadal School",null,"190002 Srinagar","India","Historical archives","Tectonics and Natural Hazards","Chronology of Historical Floods of Kashmir, India","Kashmir Valley","Historical Investigation","Climate",null,"bashirahmad1@live.com"]
["Markus Stoffel","Professor","University of Geneva, Institute for Environmental Sciences",null,"Geneva","Switzerland","Tree rings","F-M relations of floods and debris flows, mountain rivers, integrated risk assessment","Debris flows and climate change, Flood variability and change in the Valais Alps","Alps, Tatras, Carpathians, Spanish Central Massif, Kamchatka, Tien Shan, HKH, Patagonian Andes","tree rings, paleohydrology, climate risks, climate change adaptation","historical evidence","www.dendrolab.ch/en/ms.php","markus.stoffel@unige.ch"]
["Matthew Therrell","Professor","Department of Geography, University of Alabama",null,"Tuscaloosa, AL","United States","Tree rings","hydroclimate (including extreme events) reconstructions","Flood events on the Mississippi and Tennessee Rivers","Eastern U.S.","tree-ring dating","climate impacts on environment and society","https://dendro.as.ua.edu/","therrell@ua.edu"]
["Elaine Kennedy Sutherland","Senior scientist","USDA Forest Service, Rocky Mountain Research Station",null,"Missoula, MT","United States","Statistics, Tree rings","Fire/other event regime analysis","FHAES software development; event data framework development; event analysis; history of fire and other disturbance processes in the northern (US) Rocky Mountains","USA:  Northern Rocky Mountains, Great Basin, Southwestern US, Eastern Deciduous Forest, Central Mongolia ","tree-rings, scar analysis, fire/other event regime analysis, analytical software development","tree physiology, climate, stable isotopes, forest ecology, disturbance ecology","https://www.fs.fed.us/rmrs/people/esutherland","esutherland@fs.fed.us"]
["Elyssa De Carli","Junior scientist","The University of Sydney / The University of Melbourne ",null,"Sydney","Australia","Fluvial sediments","Fluvial geomorphology, fluvial reconstructions, ITRAX XRF, engineering geology (slope stability)","Fluvial reconstruction of lower Murray River & Werribee River Australia, riverbank collapse, characterisation of a flood archive for palaeoclimate reconstruction ","Murray River, SA and Werribee River, VIC, Australia ","geochemistry (ITRAX XRF, XRD), statistical analysis, sedimentology, radiocarbon ","Ethnogeomorphology ","http://sydney.edu.au/science/geosciences/people/pg_decarli.shtml","elyssa.decarli@sydney.edu.au"]
["Michael Hofstätter","Senior scientist","Central Institute for Meteorology, Climate Res. Dept.",null,"Vienna","Austria","Climate modelling","Atmospheric circulation, cyclone tracks, precipitation","Cyclone tracks in relation to flood sediments at lake Mondsee-Austria","Central  Europe, European Alps","Modelling (Statistics, Dynamic), Data Analysis","European Climate Variability; Flood Processes","http://www.waterresources.at/index.php?id=67","m.hofstaetter@zamg.ac.at"]
["Pierre Sabatier","Senior scientist","EDYTEM, University Savoie Mont Blanc-CNRS, Le Bourget du lac",null,"Chambéry","France","Lake sediments","Flood reconstruction, paleoclimate, geochronology, geochemistry","Reconstruct the flood variability in the European Alps from lake sediment","European Alps","Sedimentology, high-resolution geochemistry, multi-approach dating ","Pelaoclimate (African dust, strom) Paleoenvironment (Erosion, human activities) Pollutants (pesticides, metals) All from lake sediment","http://edytem.univ-savoie.fr/annuaire/SABATIER-Pierre","pierre.sabatier@univ-savoie.fr"]
["Federico Isla","Senior scientist","Costal Geology Research Center CONICET-UNMDP",null,"Mar del Plata","Argentina","Historical archives, Lake sediments","hydrological records, glaciolacustrine sediment records","Historical ENSO records ","South American larger rivers","time series analysis","tide-gauge records of estuaries","http://www.conicet.gov.ar/new_scp/detalle.php?id=19695&datos_academicos=yes","fisla@mdp.edu.ar"]
["Willem Toonen","Junior scientist","Aberystwyth University, Aberystwyth",null,"Aberystwyth","United Kingdom","Fluvial sediments","Floods, Lowland river systems, geomorphology, sedimentology","Palaeofloods of the Lower Rhine; Holocene fluvial geomorphology of the Nile Valley; Hydroclimatic change in Southern Kazakhstan","Rhine catchment, Cumberland Marshes (Canada), Tien Shan and Syr Darya (Kazakhstan), Nile Valley (Egypt), SW North Island New Zealand","Granulometry of flood units, geomorphological mapping, XRF core scanning, statistics, age-depth modelling","River deltas, Geoarchaeology, Historical records, Climate change","https://scholar.google.nl/citations?user=7q6NpO0AAAAJ&hl=en","w.h.j.toonen@gmail.com"]
["Jonathan D. Woodruff","Professor","Dept. of Geosciences, University of Massachusetts - Amherst",null,"Amherst, MA","United States","Fluvial sediments, Lake sediments, Marine sediments, Hydrological modelling","Flood reconstruction from rive and estuarine floodplans as well as coastal lakes and marshes","Impacts of extreme precipiation on paraglacial landscapes,delineating tsunami and typhoon induced flooding in Japan, historical changes in flood for urbanized harbors and estuaries in the Northeastern US (e.g. Boston and New York City).","Northeastern US, Japan, Caribbean","Sedimentology, Hydrodynamic and Sed. Transport Modeling","Coastal and Estuarine Processes","http://www.geo.umass.edu/faculty/woodruff/","woodruff@geo.umass.edu"]
["Aifeng Zhou","Senior scientist","School of earth and enivironmental sciences, Lanzhou University",null,"Lanzhou","China","Lake sediments","Flood reconstruction, Paleolimnology, Climate change","Flood events and climate change in alpine lakes, central China","Loess Plateau, China","Sedimentology, Varve, Grain size, XRF","Organic Geochemistry, Radiocarbon","http://wel.lzu.edu.cn/fh/07/uonxcxu.htm?1301480608","zhouaf@lzu.edu.cn, zhouaf02@yahoo.com"]
["Gerardo Benito","Professor","Museum of Natural Sciences, Spanish Research Council (CSIC).",null,"Madrid","Spain","Fluvial sediments","Geomorphology, sedimentology","Palaeoflood studies in Spain, Holocene floods and climate change, Glaciar Lake outburst floods in South America","Europe, Africa, South America, North America","Slackwater flood deposits, hydraulics,statistics","Hydrology","https://scholar.google.es/citations?user=h-P51jUAAAAJ&hl=es","benito@mncn.csic.es"]
["Lysanna Anderson","Senior scientist","United States Geological Survey",null,"Menlo Park, CA","United States","Lake sediments, Statistics, Historical archives","Paleoecology","Reconstruction of extreem precipitation events based on lake sediment properties, Reconstructing rates of ecosystem change based on pollen data, Investigation of changing land-use practices in Pre-Columbian Meso America. ","Western North America, Central America, Southern South America","Pollen, Charcoal, Physical properties of Sediments, Statistics, ","Age modeling, sedimentology, resonstruction of biomass burning, statistical methods","https://www.usgs.gov/staff-profiles/lysanna-anderson","landerson@usgs.gov"]
["Jef Vandenberghe","Professor","Vrije Universiteit Amsterdam",null,"Amsterdam","Netherlands","Fluvial sediments","Reconstructing fluvial morphology and activity","Fluvial reconstruction under climate forcing ","W.-C. Europe and China","sedimentology, geomorphological mapping","grain-size distribution","http://research.vu.nl  (from April 2017 onward)","jef.vandenberghe@vu.nl"]
{"$rows_left_out":54}
{"sheet":"statistics","index":1,"n_rows":35,"n_cols":8,"rows_kept":35,"cut":false,"hidden":false,"merged":[]}
["Germany"]
["Switzerland"]
["France"]
["United States"]
["Ireland"]
["UK"]
["Spain"]
["China"]
["Netherlands"]
["Belgium"]
["Morocco"]
["Czech Republic"]
["India"]
["Australia"]
["Austria"]
["Argentina"]
["Israel"]
["Singapore",null,null,null,null,"Professor:",{"$f":"COUNTIF(List!B2:B71,\"Professor\")","v":24}]
["Romania",null,null,null,null,"Junior scientist:",{"$f":"COUNTIF(List!B$2:B$71,\"Junior scientist\")","v":24}]
["Thailand",null,null,null,null,"Senior scientist",{"$f":"COUNTIF(List!B$2:B$71,\"Senior scientist\")","v":18}]
["Canada",null,null,null,null,"Lab manager",{"$f":"COUNTIF(List!B$2:B$71,\"Lab manager\")","v":0}]
["Ukraine",null,null,null,null,"Industry",{"$f":"COUNTIF(List!B$2:B$71,\"Industry\")","v":2},{"$f":"SUM(G18:G22)","v":68}]
["Nigeria"]
[]
[null,null,null,null,null,"Lake sediments",{"$f":"COUNTIF(List!G$2:G$71,\"Lake sediments\")","v":17}]
[null,null,null,null,null,"Fluvial sediments",{"$f":"COUNTIF(List!G$2:G$71,\"Fluvial sediments\")","v":11}]
[null,null,null,null,null,"Fjord sediments",{"$f":"COUNTIF(List!G$2:G$71,\"Fjord sediments\")","v":1}]
[null,null,null,null,null,"Marine sediments",{"$f":"COUNTIF(List!G$2:G$71,\"Marine sediments\")","v":0}]
[null,null,null,null,null,"Tree rings",{"$f":"COUNTIF(List!G$2:G$71,\"Tree rings\")","v":3}]
[null,null,null,{"$f":"COUNTIF(List!F2:F71,List!F2:F71)","v":10},null,"Historical archives",{"$f":"COUNTIF(List!G$2:G$71,\"Historical archives\")","v":16}]
[null,null,null,null,null,"Speleothems",{"$f":"COUNTIF(List!G$2:G$71,\"Speleothems\")","v":1}]
[null,null,null,null,null,"Hydroloical modelling",{"$f":"COUNTIF(List!G$2:G$71,\"Hydroloical modelling\")","v":0}]
[null,null,null,null,null,"Meteorological modelling",{"$f":"COUNTIF(List!G$2:G$71,\"Meteorological modelling\")","v":1}]
[null,null,null,null,null,"Climate modelling",{"$f":"COUNTIF(List!G$2:G$71,\"Climate modelling\")","v":3}]
[null,null,null,null,null,"Statistics",{"$f":"COUNTIF(List!G$2:G$71,\"Statistics\")","v":4},{"$f":"SUM(G25:G35)","v":57}]